{"text_format":"1","workbook":"xlsx","n_sheets":4,"sheets":["Templ","Data","Вид 1","Protocol"],"not_rendered":{"charts":0,"images":3,"macros":1,"external_links":3,"defined_names":0,"comments":4,"pivot_tables":0},"unopened":[],"bounds":{"document_bytes":16777216,"sheet_cells":100000,"rows_first":2000,"rows_last":500,"rows_between":2000,"halvings":0,"cell_chars":16384,"cell_head_chars":4096},"cells_cut":0,"cells_raw":0,"read":"whole","date_system":"1900"}

{"sheet":"Templ","index":0,"n_rows":32,"n_cols":28,"rows_kept":32,"cut":false,"hidden":false,"merged":[[5,26,6,26],[5,27,6,27],[19,16,22,16],[3,1,3,6],[14,3,14,6],[5,15,6,15],[5,16,6,16],[3,8,3,12],[3,13,3,16]]}
[1]
[]
[]
[null,"Список участников соревнований",null,null,null,null,null,null,"Название соревнований"]
[null,"№","Гимнастка","Год","Разряд","Город","Тренер",null,null,1,2,3,4,"Оценка","Сбавка","Сумма","МЕСТО",null,null,1,2,3,4,5,"Оценка","Сбавка","Сумма","МЕСТО"]
[null,1,null,null,null,null,null,null,"D",null,null,null,null,{"$f":"(SUM(J6:M6)-(MIN(J6:M6)+MAX(J6:M6)))/2","v":0},null,{"$f":"SUM(N6:N7)-SUM(O6:O7)","v":0},null,null,"D",null,null,null,null,null,{"$f":"(SUM(T6:W6)-(MIN(T6:W6)+MAX(T6:W6)))/2","v":0},null,{"$f":"SUM(Y6:Y7)-SUM(Z6:Z7)","v":0}]
[null,{"$f":"B6+1","v":2},null,null,null,null,null,null,"E",null,null,null,null,{"$f":"(SUM(J7:M7)-(MIN(J7:M7)+MAX(J7:M7)))/2","v":0},null,null,null,null,"E",null,null,null,null,null,{"$f":"(SUM(T7:X7)-(MIN(T7:X7)+MAX(T7:X7)))/3","v":0}]
[]
[]
[]
[]
[]
[]
[]
[null,null,"Сводный протокол"]
[]
[]
[]
[null,"№","Команда/Гимнастка","г.р.","Разряд","Город","Тренер",null,null,1,2,3,4,"Оценка","Сбавка","Сумма","МЕСТО"]
[null,1,null,null,null,null,null,null,"D1",null,null,null,null,{"$f":"(SUM(J20:M20)-(MIN(J20:M20)+MAX(J20:M20)))/2","v":0},null,{"$f":"SUM(N20:N23)-SUM(O20:O23)","v":0}]
[null,null,null,null,null,null,null,null,"D2",null,null,null,null,0]
[null,null,null,null,null,null,null,null,"A",null,null,null,null,{"$f":"(SUM(J22:M22)-(MIN(J22:M22)+MAX(J22:M22)))/2","v":0}]
[null,null,null,null,null,null,null,null,"E",null,null,null,null,{"$f":"(SUM(J23:M23)-(MIN(J23:M23)+MAX(J23:M23)))/2","v":0}]
[]
[]
[]
[]
[]
[]
[null,null,"Главный судья"]
[]
[null,null,"Главный секретарь"]

{"sheet":"Data","index":1,"n_rows":17,"n_cols":13,"rows_kept":17,"cut":false,"hidden":false,"merged":[[7,1,7,6]]}
[]
[null,null,"Вид соревнований","Индивидуальные"]
[null,null,"Число участников",8]
[]
[null,null,"Количество видов:",1]
[null,null,"Вид оценки:",5]
[]
[null,"Список участников соревнований",null,null,null,null,null,null,"Жеребьевка"]
[null,"№","Гимнастка","Год","Разряд","Город","Тренер",null,"№","Гимнастка","Год","Разряд","Город"]
[null,1,"Serdyukova Anastasiya",1997,"09590","UZB",null,null,{"$f":"$B$16","v":7},{"$f":"$C$16","v":"Ponzetto  Maria Laura "},{"$f":"$D$16","v":1997},{"$f":"$E$16","v":""},{"$f":"$F$16","v":"ITA"}]
[null,{"$f":"B10+1","v":2},"Belkova Olga",1998,19167,"RUS Moscow",null,null,{"$f":"$B$10","v":1},{"$f":"$C$10","v":"Serdyukova Anastasiya"},{"$f":"$D$10","v":1997},{"$f":"$E$10","v":"09590"},{"$f":"$F$10","v":"UZB"}]
[null,3,"Milacic Milena",1995,18878,"SER",null,null,{"$f":"$B$11","v":2},{"$f":"$C$11","v":"Belkova Olga"},{"$f":"$D$11","v":1998},{"$f":"$E$11","v":19167},{"$f":"$F$11","v":"RUS Moscow"}]
[null,4,"Hamrikova Nataly",1993,10481,"CZE",null,null,{"$f":"$B$12","v":3},{"$f":"$C$12","v":"Milacic Milena"},{"$f":"$D$12","v":1995},{"$f":"$E$12","v":18878},{"$f":"$F$12","v":"SER"}]
[null,5,"Sherstuk Irina",1998,"","UKR",null,null,{"$f":"$B$15","v":6},{"$f":"$C$15","v":" Omirou Irena"},{"$f":"$D$15","v":1998},{"$f":"$E$15","v":18614},{"$f":"$F$15","v":"CYP"}]
[null,6," Omirou Irena",1998,18614,"CYP",null,null,{"$f":"$B$14","v":5},{"$f":"$C$14","v":"Sherstuk Irina"},{"$f":"$D$14","v":1998},{"$f":"$E$14","v":""},{"$f":"$F$14","v":"UKR"}]
[null,7,"Ponzetto  Maria Laura ",1997,"","ITA",null,null,{"$f":"$B$17","v":8},{"$f":"$C$17","v":"Liubomeiscaia Iuliana"},{"$f":"$D$17","v":1996},{"$f":"$E$17","v":16583},{"$f":"$F$17","v":"MDA"}]
[null,8,"Liubomeiscaia Iuliana",1996,16583,"MDA",null,null,{"$f":"$B$13","v":4},{"$f":"$C$13","v":"Hamrikova Nataly"},{"$f":"$D$13","v":1993},{"$f":"$E$13","v":10481},{"$f":"$F$13","v":"CZE"}]

{"sheet":"Вид 1","index":2,"n_rows":25,"n_cols":13,"rows_kept":25,"cut":false,"hidden":false,"merged":[[21,11,22,11],[21,12,22,12],[23,11,24,11],[23,12,24,12],[15,11,16,11],[15,12,16,12],[17,11,18,11],[17,12,18,12],[19,11,20,11],[19,12,20,12],[21,1,22,1],[21,2,22,2],[23,1,24,1],[23,2,24,2],[9,11,10,11],[15,1,16,1],[15,2,16,2],[17,1,18,1],[17,2,18,2],[19,1,20,1],[19,2,20,2],[9,1,10,1],[9,2,10,2],[11,1,12,1],[11,2,12,2],[13,1,14,1],[13,2,14,2],[9,12,10,12],[11,11,12,11],[11,12,12,12],[13,11,14,11],[13,12,14,12]]}
[null,null,null,2,9,13]
[]
[]
[]
[]
[]
[]
[]
[null,"№","Гимнастка",null,1,2,3,4,5,"Оценка","Сбавка","Сумма","МЕСТО"]
[null,{"$f":"Data!$B$16","v":7},{"$f":"Data!$C$16","v":"Ponzetto  Maria Laura "},"D",null,null,null,null,null,{"$f":"(SUM(E10:H10)-(MIN(E10:H10)+MAX(E10:H10)))/2","v":0},null,13.166,{"$f":"RANK(L10,$L$10:$L$25,0)","v":8}]
[null,null,null,"E",null,null,null,null,null,{"$f":"(SUM(E11:I11)-(MIN(E11:I11)+MAX(E11:I11)))/3","v":0}]
[null,{"$f":"Data!$B$10","v":1},{"$f":"Data!$C$10","v":"Serdyukova Anastasiya"},"D",null,null,null,null,null,{"$f":"(SUM(E12:H12)-(MIN(E12:H12)+MAX(E12:H12)))/2","v":0},null,17.45,{"$f":"RANK(L12,$L$10:$L$25,0)","v":1}]
[null,null,null,"E",null,null,null,null,null,{"$f":"(SUM(E13:I13)-(MIN(E13:I13)+MAX(E13:I13)))/3","v":0}]
[null,{"$f":"Data!$B$11","v":2},{"$f":"Data!$C$11","v":"Belkova Olga"},"D",null,null,null,null,null,{"$f":"(SUM(E14:H14)-(MIN(E14:H14)+MAX(E14:H14)))/2","v":0},null,16.866,{"$f":"RANK(L14,$L$10:$L$25,0)","v":2}]
[null,null,null,"E",null,null,null,null,null,{"$f":"(SUM(E15:I15)-(MIN(E15:I15)+MAX(E15:I15)))/3","v":0}]
[null,{"$f":"Data!$B$12","v":3},{"$f":"Data!$C$12","v":"Milacic Milena"},"D",null,null,null,null,null,{"$f":"(SUM(E16:H16)-(MIN(E16:H16)+MAX(E16:H16)))/2","v":0},null,14.616,{"$f":"RANK(L16,$L$10:$L$25,0)","v":5}]
[null,null,null,"E",null,null,null,null,null,{"$f":"(SUM(E17:I17)-(MIN(E17:I17)+MAX(E17:I17)))/3","v":0}]
[null,{"$f":"Data!$B$15","v":6},{"$f":"Data!$C$15","v":" Omirou Irena"},"D",null,null,null,null,null,{"$f":"(SUM(E18:H18)-(MIN(E18:H18)+MAX(E18:H18)))/2","v":0},null,15.4,{"$f":"RANK(L18,$L$10:$L$25,0)","v":4}]
[null,null,null,"E",null,null,null,null,null,{"$f":"(SUM(E19:I19)-(MIN(E19:I19)+MAX(E19:I19)))/3","v":0}]
[null,{"$f":"Data!$B$14","v":5},{"$f":"Data!$C$14","v":"Sherstuk Irina"},"D",null,null,null,null,null,{"$f":"(SUM(E20:H20)-(MIN(E20:H20)+MAX(E20:H20)))/2","v":0},null,16.167000000000002,{"$f":"RANK(L20,$L$10:$L$25,0)","v":3}]
[null,null,null,"E",null,null,null,null,null,{"$f":"(SUM(E21:I21)-(MIN(E21:I21)+MAX(E21:I21)))/3","v":0}]
[null,{"$f":"Data!$B$17","v":8},{"$f":"Data!$C$17","v":"Liubomeiscaia Iuliana"},"D",null,null,null,null,null,{"$f":"(SUM(E22:H22)-(MIN(E22:H22)+MAX(E22:H22)))/2","v":0},null,13.266999999999999,{"$f":"RANK(L22,$L$10:$L$25,0)","v":7}]
[null,null,null,"E",null,null,null,null,null,{"$f":"(SUM(E23:I23)-(MIN(E23:I23)+MAX(E23:I23)))/3","v":0}]
[null,{"$f":"Data!$B$13","v":4},{"$f":"Data!$C$13","v":"Hamrikova Nataly"},"D",7.4,7,6.9,6.9,null,{"$f":"(SUM(E24:H24)-(MIN(E24:H24)+MAX(E24:H24)))/2","v":6.9500000000000011},null,{"$f":"SUM(J24:J25)-SUM(K24:K25)","v":14.050000000000002},{"$f":"RANK(L24,$L$10:$L$25,0)","v":6}]
[null,null,null,"E",8.1,8.1999999999999993,7.5,7.5,7.2,{"$f":"(SUM(E25:I25)-(MIN(E25:I25)+MAX(E25:I25)))/3","v":7.7},0.6]

{"sheet":"Protocol","index":3,"n_rows":54,"n_cols":8,"rows_kept":54,"cut":false,"hidden":false,"merged":[[40,3,40,6],[51,4,51,10],[53,4,53,9],[0,2,3,8],[7,3,7,6],[18,3,18,6],[29,3,29,6]]}
[null,null,"International individual/national groups Rhythmic Gymnastic  Tournament\n«MARINA CUP»  April 17-21nd 2014\n"]
[]
[]
[]
[]
[]
[]
[null,null,"Finals Seniors","HOOP"]
[null,"№","gymnast",null,"Разряд","cantry","hoop","Rank"]
[null,{"$f":"IF(ISBLANK(Data!$B$10), \"\", Data!$B$10)","v":1},{"$f":"IF(ISBLANK(Data!$C$10), \"\", Data!$C$10)","v":"Serdyukova Anastasiya"},{"$f":"IF(ISBLANK(Data!$D$10), \"\", Data!$D$10)","v":1997},{"$f":"IF(ISBLANK(Data!$E$10), \"\", Data!$E$10)","v":"09590"},{"$f":"IF(ISBLANK(Data!$F$10), \"\", Data!$F$10)","v":"UZB"},{"$f":"'Вид 1'!$L$12","v":17.45},1]
[null,{"$f":"IF(ISBLANK(Data!$B$11), \"\", Data!$B$11)","v":2},{"$f":"IF(ISBLANK(Data!$C$11), \"\", Data!$C$11)","v":"Belkova Olga"},{"$f":"IF(ISBLANK(Data!$D$11), \"\", Data!$D$11)","v":1998},{"$f":"IF(ISBLANK(Data!$E$11), \"\", Data!$E$11)","v":19167},"RUS",{"$f":"'Вид 1'!$L$14","v":16.866},2]
[null,3,{"$f":"IF(ISBLANK(Data!$C$14), \"\", Data!$C$14)","v":"Sherstuk Irina"},{"$f":"IF(ISBLANK(Data!$D$14), \"\", Data!$D$14)","v":1998},{"$f":"IF(ISBLANK(Data!$E$14), \"\", Data!$E$14)","v":""},{"$f":"IF(ISBLANK(Data!$F$14), \"\", Data!$F$14)","v":"UKR"},{"$f":"'Вид 1'!$L$20","v":16.167000000000002},3]
[null,4,{"$f":"IF(ISBLANK(Data!$C$15), \"\", Data!$C$15)","v":" Omirou Irena"},{"$f":"IF(ISBLANK(Data!$D$15), \"\", Data!$D$15)","v":1998},{"$f":"IF(ISBLANK(Data!$E$15), \"\", Data!$E$15)","v":18614},{"$f":"IF(ISBLANK(Data!$F$15), \"\", Data!$F$15)","v":"CYP"},{"$f":"'Вид 1'!$L$18","v":15.4},4]
[null,5,{"$f":"IF(ISBLANK(Data!$C$12), \"\", Data!$C$12)","v":"Milacic Milena"},{"$f":"IF(ISBLANK(Data!$D$12), \"\", Data!$D$12)","v":1995},{"$f":"IF(ISBLANK(Data!$E$12), \"\", Data!$E$12)","v":18878},{"$f":"IF(ISBLANK(Data!$F$12), \"\", Data!$F$12)","v":"SER"},{"$f":"'Вид 1'!$L$16","v":14.616},5]
[null,6,{"$f":"IF(ISBLANK(Data!$C$13), \"\", Data!$C$13)","v":"Hamrikova Nataly"},{"$f":"IF(ISBLANK(Data!$D$13), \"\", Data!$D$13)","v":1993},{"$f":"IF(ISBLANK(Data!$E$13), \"\", Data!$E$13)","v":10481},{"$f":"IF(ISBLANK(Data!$F$13), \"\", Data!$F$13)","v":"CZE"},{"$f":"'Вид 1'!$L$24","v":14.050000000000002},6]
[null,7,{"$f":"IF(ISBLANK(Data!$C$17), \"\", Data!$C$17)","v":"Liubomeiscaia Iuliana"},{"$f":"IF(ISBLANK(Data!$D$17), \"\", Data!$D$17)","v":1996},{"$f":"IF(ISBLANK(Data!$E$17), \"\", Data!$E$17)","v":16583},{"$f":"IF(ISBLANK(Data!$F$17), \"\", Data!$F$17)","v":"MDA"},{"$f":"'Вид 1'!$L$22","v":13.266999999999999},7]
[null,8,{"$f":"IF(ISBLANK(Data!$C$16), \"\", Data!$C$16)","v":"Ponzetto  Maria Laura "},{"$f":"IF(ISBLANK(Data!$D$16), \"\", Data!$D$16)","v":1997},{"$f":"IF(ISBLANK(Data!$E$16), \"\", Data!$E$16)","v":""},{"$f":"IF(ISBLANK(Data!$F$16), \"\", Data!$F$16)","v":"ITA"},{"$f":"'Вид 1'!$L$10","v":13.166},8]
[]
[null,null,"Finals Seniors","Ball"]
[null,"№","gymnast",null,"Разряд","cantry","ball","Rank"]
[null,1,{"$f":"IF(ISBLANK([1]Data!$C$12), \"\", [1]Data!$C$12)","v":"Liubomeiscaia Iuliana"},{"$f":"IF(ISBLANK([1]Data!$D$12), \"\", [1]Data!$D$12)","v":1996},{"$f":"IF(ISBLANK([1]Data!$E$12), \"\", [1]Data!$E$12)","v":16583},{"$f":"IF(ISBLANK([1]Data!$F$12), \"\", [1]Data!$F$12)","v":"MDA"},{"$f":"'[1]Вид 1'!$L$10","v":16.850000000000001},1]
[null,2,{"$f":"IF(ISBLANK([1]Data!$C$13), \"\", [1]Data!$C$13)","v":"Milacic Milena"},{"$f":"IF(ISBLANK([1]Data!$D$13), \"\", [1]Data!$D$13)","v":1995},{"$f":"IF(ISBLANK([1]Data!$E$13), \"\", [1]Data!$E$13)","v":18878},{"$f":"IF(ISBLANK([1]Data!$F$13), \"\", [1]Data!$F$13)","v":"SER"},{"$f":"'[1]Вид 1'!$L$12","v":16.466999999999999},2]
[null,3,{"$f":"IF(ISBLANK([1]Data!$C$11), \"\", [1]Data!$C$11)","v":"Romanova Arina"},{"$f":"IF(ISBLANK([1]Data!$D$11), \"\", [1]Data!$D$11)","v":1998},{"$f":"IF(ISBLANK([1]Data!$E$11), \"\", [1]Data!$E$11)","v":23177},"RUS",{"$f":"'[1]Вид 1'!$L$20","v":16.417000000000002},3]
[null,4,{"$f":"IF(ISBLANK([1]Data!$C$10), \"\", [1]Data!$C$10)","v":"Serdyukova Anastasiya"},{"$f":"IF(ISBLANK([1]Data!$D$10), \"\", [1]Data!$D$10)","v":1997},{"$f":"IF(ISBLANK([1]Data!$E$10), \"\", [1]Data!$E$10)","v":"09590"},{"$f":"IF(ISBLANK([1]Data!$F$10), \"\", [1]Data!$F$10)","v":"UZB"},{"$f":"'[1]Вид 1'!$L$18","v":15.716666666666665},4]
[null,5,{"$f":"IF(ISBLANK([1]Data!$C$14), \"\", [1]Data!$C$14)","v":"Hamrikova Nataly"},{"$f":"IF(ISBLANK([1]Data!$D$14), \"\", [1]Data!$D$14)","v":1993},{"$f":"IF(ISBLANK([1]Data!$E$14), \"\", [1]Data!$E$14)","v":10481},{"$f":"IF(ISBLANK([1]Data!$F$14), \"\", [1]Data!$F$14)","v":"CZE"},{"$f":"'[1]Вид 1'!$L$22","v":15.417},5]
[null,6,{"$f":"IF(ISBLANK([1]Data!$C$15), \"\", [1]Data!$C$15)","v":"Sherstuk Irina"},{"$f":"IF(ISBLANK([1]Data!$D$15), \"\", [1]Data!$D$15)","v":1998},{"$f":"IF(ISBLANK([1]Data!$E$15), \"\", [1]Data!$E$15)","v":""},{"$f":"IF(ISBLANK([1]Data!$F$15), \"\", [1]Data!$F$15)","v":"UKR"},{"$f":"'[1]Вид 1'!$L$16","v":15.35},6]
[null,7,{"$f":"IF(ISBLANK([1]Data!$C$16), \"\", [1]Data!$C$16)","v":" Omirou Irena"},{"$f":"IF(ISBLANK([1]Data!$D$16), \"\", [1]Data!$D$16)","v":1998},{"$f":"IF(ISBLANK([1]Data!$E$16), \"\", [1]Data!$E$16)","v":18614},{"$f":"IF(ISBLANK([1]Data!$F$16), \"\", [1]Data!$F$16)","v":"CYP"},{"$f":"'[1]Вид 1'!$L$14","v":14.85},7]
[null,8,{"$f":"IF(ISBLANK([1]Data!$C$17), \"\", [1]Data!$C$17)","v":"Duquesne Cartaya /Yansy De La Caridad"},{"$f":"IF(ISBLANK([1]Data!$D$17), \"\", [1]Data!$D$17)","v":1997},{"$f":"IF(ISBLANK([1]Data!$E$17), \"\", [1]Data!$E$17)","v":23132},{"$f":"IF(ISBLANK([1]Data!$F$17), \"\", [1]Data!$F$17)","v":"CUB"},{"$f":"'[1]Вид 1'!$L$24","v":13.532999999999999},8]
[]
[null,null,"Finals Seniors","Clubs"]
[null,"№","gymnast",null,"Разряд","cantry","clubs","Rank"]
[null,1,{"$f":"IF(ISBLANK([2]Data!$C$17), \"\", [2]Data!$C$17)","v":"Serdyukova Anastasiya"},{"$f":"IF(ISBLANK([2]Data!$D$17), \"\", [2]Data!$D$17)","v":1997},{"$f":"IF(ISBLANK([2]Data!$E$17), \"\", [2]Data!$E$17)","v":"09590"},{"$f":"IF(ISBLANK([2]Data!$F$17), \"\", [2]Data!$F$17)","v":"UZB"},{"$f":"'[2]Вид 1'!$L$24","v":16.966666666666669},1]
[null,2,{"$f":"IF(ISBLANK([2]Data!$C$16), \"\", [2]Data!$C$16)","v":"Babushkina Aleksandra"},{"$f":"IF(ISBLANK([2]Data!$D$16), \"\", [2]Data!$D$16)","v":1998},{"$f":"IF(ISBLANK([2]Data!$E$16), \"\", [2]Data!$E$16)","v":29144},"RUS",{"$f":"'[2]Вид 1'!$L$12","v":16.88333333333334},2]
[null,3,{"$f":"IF(ISBLANK([2]Data!$C$10), \"\", [2]Data!$C$10)","v":"Liubomeiscaia Iuliana"},{"$f":"IF(ISBLANK([2]Data!$D$10), \"\", [2]Data!$D$10)","v":1996},{"$f":"IF(ISBLANK([2]Data!$E$10), \"\", [2]Data!$E$10)","v":16583},{"$f":"IF(ISBLANK([2]Data!$F$10), \"\", [2]Data!$F$10)","v":"MDA"},{"$f":"'[2]Вид 1'!$L$20","v":16.816666666666666},3]
[null,4,{"$f":"IF(ISBLANK([2]Data!$C$11), \"\", [2]Data!$C$11)","v":"Milacic Milena"},{"$f":"IF(ISBLANK([2]Data!$D$11), \"\", [2]Data!$D$11)","v":1995},{"$f":"IF(ISBLANK([2]Data!$E$11), \"\", [2]Data!$E$11)","v":18878},{"$f":"IF(ISBLANK([2]Data!$F$11), \"\", [2]Data!$F$11)","v":"SER"},{"$f":"'[2]Вид 1'!$L$22","v":16.466666666666665},4]
[null,5,{"$f":"IF(ISBLANK([2]Data!$C$12), \"\", [2]Data!$C$12)","v":"Hamrikova Nataly"},{"$f":"IF(ISBLANK([2]Data!$D$12), \"\", [2]Data!$D$12)","v":1993},{"$f":"IF(ISBLANK([2]Data!$E$12), \"\", [2]Data!$E$12)","v":10481},{"$f":"IF(ISBLANK([2]Data!$F$12), \"\", [2]Data!$F$12)","v":"CZE"},{"$f":"'[2]Вид 1'!$L$18","v":15.366666666666667},5]
[null,6,{"$f":"IF(ISBLANK([2]Data!$C$13), \"\", [2]Data!$C$13)","v":"Sherstuk Irina"},{"$f":"IF(ISBLANK([2]Data!$D$13), \"\", [2]Data!$D$13)","v":1998},{"$f":"IF(ISBLANK([2]Data!$E$13), \"\", [2]Data!$E$13)","v":""},{"$f":"IF(ISBLANK([2]Data!$F$13), \"\", [2]Data!$F$13)","v":"UKR"},{"$f":"'[2]Вид 1'!$L$16","v":15.35},6]
[null,7,{"$f":"IF(ISBLANK([2]Data!$C$14), \"\", [2]Data!$C$14)","v":" Omirou Irena"},{"$f":"IF(ISBLANK([2]Data!$D$14), \"\", [2]Data!$D$14)","v":1998},{"$f":"IF(ISBLANK([2]Data!$E$14), \"\", [2]Data!$E$14)","v":18614},{"$f":"IF(ISBLANK([2]Data!$F$14), \"\", [2]Data!$F$14)","v":"CYP"},{"$f":"'[2]Вид 1'!$L$14","v":14.716666666666669},7]
[null,8,{"$f":"IF(ISBLANK([2]Data!$C$15), \"\", [2]Data!$C$15)","v":"Duquesne Cartaya /Yansy De La Caridad"},{"$f":"IF(ISBLANK([2]Data!$D$15), \"\", [2]Data!$D$15)","v":1997},{"$f":"IF(ISBLANK([2]Data!$E$15), \"\", [2]Data!$E$15)","v":23132},{"$f":"IF(ISBLANK([2]Data!$F$15), \"\", [2]Data!$F$15)","v":"CUB"},{"$f":"'[2]Вид 1'!$L$10","v":14.566666666666666},8]
[]
[null,null,"Finals Seniors","Ribbon"]
[null,"№","gymnast",null,"Разряд","cantry","ribbon","Rank"]
[null,1,{"$f":"IF(ISBLANK([3]Data!$C$11), \"\", [3]Data!$C$11)","v":"Polishchuk Viktoriia"},{"$f":"IF(ISBLANK([3]Data!$D$11), \"\", [3]Data!$D$11)","v":1994},null,"RUS",{"$f":"'[3]Вид 1'!$L$14","v":16.95},1]
[null,2,{"$f":"IF(ISBLANK([3]Data!$C$10), \"\", [3]Data!$C$10)","v":"Serdyukova Anastasiya"},{"$f":"IF(ISBLANK([3]Data!$D$10), \"\", [3]Data!$D$10)","v":1997},null,{"$f":"IF(ISBLANK([3]Data!$F$10), \"\", [3]Data!$F$10)","v":"UZB"},{"$f":"'[3]Вид 1'!$L$12","v":16.600000000000001},2]
[null,3,{"$f":"IF(ISBLANK([3]Data!$C$14), \"\", [3]Data!$C$14)","v":"Hamrikova Nataly"},{"$f":"IF(ISBLANK([3]Data!$D$14), \"\", [3]Data!$D$14)","v":1993},null,{"$f":"IF(ISBLANK([3]Data!$F$14), \"\", [3]Data!$F$14)","v":"CZE"},{"$f":"'[3]Вид 1'!$L$16","v":15},3]
[null,4,{"$f":"IF(ISBLANK([3]Data!$C$15), \"\", [3]Data!$C$15)","v":"Sherstuk Irina"},{"$f":"IF(ISBLANK([3]Data!$D$15), \"\", [3]Data!$D$15)","v":1998},null,{"$f":"IF(ISBLANK([3]Data!$F$15), \"\", [3]Data!$F$15)","v":"UKR"},{"$f":"'[3]Вид 1'!$L$24","v":14.883333333333333},4]
[null,5,{"$f":"IF(ISBLANK([3]Data!$C$12), \"\", [3]Data!$C$12)","v":"Liubomeiscaia Iuliana"},{"$f":"IF(ISBLANK([3]Data!$D$12), \"\", [3]Data!$D$12)","v":1996},null,{"$f":"IF(ISBLANK([3]Data!$F$12), \"\", [3]Data!$F$12)","v":"MDA"},{"$f":"'[3]Вид 1'!$L$18","v":14.483333333333334},5]
[null,6,{"$f":"IF(ISBLANK([3]Data!$C$13), \"\", [3]Data!$C$13)","v":"Milacic Milena"},{"$f":"IF(ISBLANK([3]Data!$D$13), \"\", [3]Data!$D$13)","v":1995},null,{"$f":"IF(ISBLANK([3]Data!$F$13), \"\", [3]Data!$F$13)","v":"SER"},{"$f":"'[3]Вид 1'!$L$22","v":13.866666666666667},6]
[null,7,{"$f":"IF(ISBLANK([3]Data!$C$17), \"\", [3]Data!$C$17)","v":"Duquesne Cartaya /Yansy De La Caridad"},{"$f":"IF(ISBLANK([3]Data!$D$17), \"\", [3]Data!$D$17)","v":1997},null,{"$f":"IF(ISBLANK([3]Data!$F$17), \"\", [3]Data!$F$17)","v":"CUB"},{"$f":"'[3]Вид 1'!$L$10","v":13.816666666666666},7]
[null,8,{"$f":"IF(ISBLANK([3]Data!$C$16), \"\", [3]Data!$C$16)","v":" Omirou Irena"},{"$f":"IF(ISBLANK([3]Data!$D$16), \"\", [3]Data!$D$16)","v":1998},null,{"$f":"IF(ISBLANK([3]Data!$F$16), \"\", [3]Data!$F$16)","v":"CYP"},{"$f":"'[3]Вид 1'!$L$20","v":13.383333333333333},8]
[]
[null,"  Сhief Judge of the competition",null,null,"Bravet Quesis Juana Maria FIG CUBA"]
[]
[null," Secretary of the competition",null,null," Kalinina Lyubov    NK RUSSIA"]