{"text_format":"1","workbook":"xlsx","n_sheets":6,"sheets":["Templ","Data","Вид 1","Вид 2","Вид 3","Protocol"],"not_rendered":{"charts":0,"images":3,"macros":1,"external_links":0,"defined_names":0,"comments":6,"pivot_tables":0},"unopened":[],"bounds":{"document_bytes":16777216,"sheet_cells":100000,"rows_first":2000,"rows_last":500,"rows_between":2000,"halvings":0,"cell_chars":16384,"cell_head_chars":4096},"cells_cut":0,"cells_raw":0,"read":"whole","date_system":"1900"}

{"sheet":"Templ","index":0,"n_rows":32,"n_cols":28,"rows_kept":32,"cut":false,"hidden":false,"merged":[[5,26,6,26],[5,27,6,27],[19,16,22,16],[3,1,3,6],[14,3,14,6],[5,15,6,15],[5,16,6,16],[3,8,3,12],[3,13,3,16]]}
[1]
[]
[]
[null,"Список участников соревнований",null,null,null,null,null,null,"Название соревнований"]
[null,"№","Гимнастка","Год","Разряд","Город","Тренер",null,null,1,2,3,4,"Оценка","Сбавка","Сумма","МЕСТО",null,null,1,2,3,4,5,"Оценка","Сбавка","Сумма","МЕСТО"]
[null,1,null,null,null,null,null,null,"D",null,null,null,null,{"$f":"(SUM(J6:M6)-(MIN(J6:M6)+MAX(J6:M6)))/2","v":0},null,{"$f":"SUM(N6:N7)-SUM(O6:O7)","v":0},null,null,"D",null,null,null,null,null,{"$f":"(SUM(T6:W6)-(MIN(T6:W6)+MAX(T6:W6)))/2","v":0},null,{"$f":"SUM(Y6:Y7)-SUM(Z6:Z7)","v":0}]
[null,{"$f":"B6+1","v":2},null,null,null,null,null,null,"E",null,null,null,null,{"$f":"(SUM(J7:M7)-(MIN(J7:M7)+MAX(J7:M7)))/2","v":0},null,null,null,null,"E",null,null,null,null,null,{"$f":"(SUM(T7:X7)-(MIN(T7:X7)+MAX(T7:X7)))/3","v":0}]
[]
[]
[]
[]
[]
[]
[]
[null,null,"Сводный протокол"]
[]
[]
[]
[null,"№","Команда/Гимнастка","г.р.","Разряд","Город","Тренер",null,null,1,2,3,4,"Оценка","Сбавка","Сумма","МЕСТО"]
[null,1,null,null,null,null,null,null,"D1",null,null,null,null,{"$f":"(SUM(J20:M20)-(MIN(J20:M20)+MAX(J20:M20)))/2","v":0},null,{"$f":"SUM(N20:N23)-SUM(O20:O23)","v":0}]
[null,null,null,null,null,null,null,null,"D2",null,null,null,null,0]
[null,null,null,null,null,null,null,null,"A",null,null,null,null,{"$f":"(SUM(J22:M22)-(MIN(J22:M22)+MAX(J22:M22)))/2","v":0}]
[null,null,null,null,null,null,null,null,"E",null,null,null,null,{"$f":"(SUM(J23:M23)-(MIN(J23:M23)+MAX(J23:M23)))/2","v":0}]
[]
[]
[]
[]
[]
[]
[null,null,"Главный судья"]
[]
[null,null,"Главный секретарь"]

{"sheet":"Data","index":1,"n_rows":26,"n_cols":13,"rows_kept":26,"cut":false,"hidden":false,"merged":[[7,1,7,6]]}
[]
[null,null,"Вид соревнований","Индивидуальные"]
[null,null,"Число участников",17]
[]
[null,null,"Количество видов:",3]
[null,null,"Вид оценки:",5]
[]
[null,"Список участников соревнований",null,null,null,null,null,null,"Жеребьевка"]
[null,"№","Гимнастка","Год","Разряд","Город","Тренер",null,"№","Гимнастка","Год","Разряд","Город"]
[null,1,"Lenshina Ekaterina",2003,null,"RUS Ivanovo",null,null,{"$f":"$B$15","v":6},{"$f":"$C$15","v":"Ikramova Asal"},{"$f":"$D$15","v":2002},{"$f":"$E$15","v":0},{"$f":"$F$15","v":"UZB"}]
[null,{"$f":"B10+1","v":2},"Korin Anastasiya",2003,null,"RUS Ivanovo",null,null,{"$f":"$B$17","v":8},{"$f":"$C$17","v":"Zilber Sofia"},{"$f":"$D$17","v":2003},{"$f":"$E$17","v":0},{"$f":"$F$17","v":"RUS Eketerinburg"}]
[null,3,"Ivanova Valeriya",2003,null,"RUS Ivanovo",null,null,{"$f":"$B$22","v":13},{"$f":"$C$22","v":"Pavlovskaya  Appolinariya"},{"$f":"$D$22","v":2003},{"$f":"$E$22","v":0},{"$f":"$F$22","v":"RUS St.Peterburg"}]
[null,4,"Ansaldo Alice",2003,null,"ITA",null,null,{"$f":"$B$14","v":5},{"$f":"$C$14","v":"Luana Gomes"},{"$f":"$D$14","v":2003},{"$f":"$E$14","v":0},{"$f":"$F$14","v":"POR"}]
[null,5,"Luana Gomes",2003,null,"POR",null,null,{"$f":"$B$26","v":17},{"$f":"$C$26","v":"Kurmaeva Maria"},{"$f":"$D$26","v":2003},{"$f":"$E$26","v":0},{"$f":"$F$26","v":"RUS Shuya"}]
[null,6,"Ikramova Asal",2002,null,"UZB",null,null,{"$f":"$B$18","v":9},{"$f":"$C$18","v":"Brilyakova Darya"},{"$f":"$D$18","v":2003},{"$f":"$E$18","v":0},{"$f":"$F$18","v":"RUS Krasnoyarsk"}]
[null,7,null,null,null,null,null,null,{"$f":"$B$21","v":12},{"$f":"$C$21","v":"Eresko Elizaveta"},{"$f":"$D$21","v":2003},{"$f":"$E$21","v":0},{"$f":"$F$21","v":"RUS St.Peterburg"}]
[null,8,"Zilber Sofia",2003,null,"RUS Eketerinburg",null,null,{"$f":"$B$24","v":15},{"$f":"$C$24","v":"Myasnyankina Uliya"},{"$f":"$D$24","v":2003},{"$f":"$E$24","v":0},{"$f":"$F$24","v":"RUS Tomsk"}]
[null,9,"Brilyakova Darya",2003,null,"RUS Krasnoyarsk",null,null,{"$f":"$B$16","v":7},{"$f":"$C$16","v":0},{"$f":"$D$16","v":0},{"$f":"$E$16","v":0},{"$f":"$F$16","v":0}]
[null,10,"Strashko Anna",2003,null,"RUS Orehovo-Zuevo",null,null,{"$f":"$B$23","v":14},{"$f":"$C$23","v":"Bryshevich Zlata"},{"$f":"$D$23","v":2003},{"$f":"$E$23","v":0},{"$f":"$F$23","v":"RUS Severs"}]
[null,11,null,null,4.2,3.9,4.3,null,{"$f":"$B$20","v":11},{"$f":"$C$20","v":0},{"$f":"$D$20","v":0},{"$f":"$E$20","v":4.2},{"$f":"$F$20","v":3.9}]
[null,12,"Eresko Elizaveta",2003,null,"RUS St.Peterburg",null,null,{"$f":"$B$25","v":16},{"$f":"$C$25","v":"Lakireva Olga"},{"$f":"$D$25","v":2003},{"$f":"$E$25","v":0},{"$f":"$F$25","v":"RUS Chelyabinsk"}]
[null,13,"Pavlovskaya  Appolinariya",2003,null,"RUS St.Peterburg",null,null,{"$f":"$B$19","v":10},{"$f":"$C$19","v":"Strashko Anna"},{"$f":"$D$19","v":2003},{"$f":"$E$19","v":0},{"$f":"$F$19","v":"RUS Orehovo-Zuevo"}]
[null,14,"Bryshevich Zlata",2003,null,"RUS Severs",null,null,{"$f":"$B$13","v":4},{"$f":"$C$13","v":"Ansaldo Alice"},{"$f":"$D$13","v":2003},{"$f":"$E$13","v":0},{"$f":"$F$13","v":"ITA"}]
[null,15,"Myasnyankina Uliya",2003,null,"RUS Tomsk",null,null,{"$f":"$B$11","v":2},{"$f":"$C$11","v":"Korin Anastasiya"},{"$f":"$D$11","v":2003},{"$f":"$E$11","v":0},{"$f":"$F$11","v":"RUS Ivanovo"}]
[null,16,"Lakireva Olga",2003,null,"RUS Chelyabinsk",null,null,{"$f":"$B$12","v":3},{"$f":"$C$12","v":"Ivanova Valeriya"},{"$f":"$D$12","v":2003},{"$f":"$E$12","v":0},{"$f":"$F$12","v":"RUS Ivanovo"}]
[null,17,"Kurmaeva Maria",2003,null,"RUS Shuya",null,null,{"$f":"$B$10","v":1},{"$f":"$C$10","v":"Lenshina Ekaterina"},{"$f":"$D$10","v":2003},{"$f":"$E$10","v":0},{"$f":"$F$10","v":"RUS Ivanovo"}]

{"sheet":"Вид 1","index":2,"n_rows":43,"n_cols":13,"rows_kept":43,"cut":false,"hidden":false,"merged":[[9,1,10,1],[9,2,10,2],[11,1,12,1],[11,2,12,2],[13,1,14,1],[13,2,14,2],[15,1,16,1],[15,2,16,2],[17,1,18,1],[17,2,18,2],[19,1,20,1],[19,2,20,2],[31,2,32,2],[21,1,22,1],[21,2,22,2],[23,1,24,1],[23,2,24,2],[25,1,26,1],[25,2,26,2],[9,12,10,12],[11,11,12,11],[11,12,12,12],[13,11,14,11],[13,12,14,12],[39,1,40,1],[39,2,40,2],[41,1,42,1],[41,2,42,2],[9,11,10,11],[33,1,34,1],[33,2,34,2],[35,1,36,1],[35,2,36,2],[37,1,38,1],[37,2,38,2],[27,1,28,1],[27,2,28,2],[29,1,30,1],[29,2,30,2],[31,1,32,1],[15,11,16,11],[15,12,16,12],[17,11,18,11],[17,12,18,12],[19,11,20,11],[19,12,20,12],[21,11,22,11],[21,12,22,12],[23,11,24,11],[23,12,24,12],[25,11,26,11],[25,12,26,12],[27,11,28,11],[27,12,28,12],[29,11,30,11],[29,12,30,12],[31,11,32,11],[31,12,32,12],[39,11,40,11],[39,12,40,12],[41,11,42,11],[41,12,42,12],[33,11,34,11],[33,12,34,12],[35,11,36,11],[35,12,36,12],[37,11,38,11],[37,12,38,12]]}
[null,null,null,2,9,13]
[]
[]
[]
[]
[]
[]
[]
[null,"№","Гимнастка",null,1,2,3,4,5,"Оценка","Сбавка","Сумма","МЕСТО"]
[null,{"$f":"Data!$B$15","v":6},{"$f":"Data!$C$15","v":"Ikramova Asal"},"D",null,null,null,null,null,{"$f":"(SUM(E10:H10)-(MIN(E10:H10)+MAX(E10:H10)))/2","v":0},null,{"$f":"SUM(J10:J11)-SUM(K10:K11)","v":0},{"$f":"RANK(L10,$L$10:$L$43,0)","v":15}]
[null,null,null,"E",null,null,null,null,null,{"$f":"(SUM(E11:I11)-(MIN(E11:I11)+MAX(E11:I11)))/3","v":0}]
[null,{"$f":"Data!$B$17","v":8},{"$f":"Data!$C$17","v":"Zilber Sofia"},"D",3.9,5.5,5.9,5.3,null,{"$f":"(SUM(E12:H12)-(MIN(E12:H12)+MAX(E12:H12)))/2","v":5.4},null,{"$f":"SUM(J12:J13)-SUM(K12:K13)","v":13.733333333333338},{"$f":"RANK(L12,$L$10:$L$43,0)","v":4}]
[null,null,null,"E",8.3000000000000007,8.4,8.1,8.3000000000000007,8.6999999999999993,{"$f":"(SUM(E13:I13)-(MIN(E13:I13)+MAX(E13:I13)))/3","v":8.3333333333333375}]
[null,{"$f":"Data!$B$22","v":13},{"$f":"Data!$C$22","v":"Pavlovskaya  Appolinariya"},"D",4.4000000000000004,5.5,4.2,5.3,null,{"$f":"(SUM(E14:H14)-(MIN(E14:H14)+MAX(E14:H14)))/2","v":4.8500000000000014},null,{"$f":"SUM(J14:J15)-SUM(K14:K15)","v":12.616666666666671},{"$f":"RANK(L14,$L$10:$L$43,0)","v":9}]
[null,null,null,"E",8.3000000000000007,7.9,7.2,7.5,7.9,{"$f":"(SUM(E15:I15)-(MIN(E15:I15)+MAX(E15:I15)))/3","v":7.7666666666666684}]
[null,{"$f":"Data!$B$14","v":5},{"$f":"Data!$C$14","v":"Luana Gomes"},"D",3.8,4.3,4.8,4.4000000000000004,null,{"$f":"(SUM(E16:H16)-(MIN(E16:H16)+MAX(E16:H16)))/2","v":4.3499999999999988},null,{"$f":"SUM(J16:J17)-SUM(K16:K17)","v":12.15},{"$f":"RANK(L16,$L$10:$L$43,0)","v":13}]
[null,null,null,"E",8.1,8.1999999999999993,7.6,7.6,7.7,{"$f":"(SUM(E17:I17)-(MIN(E17:I17)+MAX(E17:I17)))/3","v":7.8000000000000016}]
[null,{"$f":"Data!$B$26","v":17},{"$f":"Data!$C$26","v":"Kurmaeva Maria"},"D",null,null,null,null,null,{"$f":"(SUM(E18:H18)-(MIN(E18:H18)+MAX(E18:H18)))/2","v":0},null,13.65,{"$f":"RANK(L18,$L$10:$L$43,0)","v":5}]
[null,null,null,"E",null,null,null,null,null,{"$f":"(SUM(E19:I19)-(MIN(E19:I19)+MAX(E19:I19)))/3","v":0}]
[null,{"$f":"Data!$B$18","v":9},{"$f":"Data!$C$18","v":"Brilyakova Darya"},"D",5.8,5.3,6.5,5.3,null,{"$f":"(SUM(E20:H20)-(MIN(E20:H20)+MAX(E20:H20)))/2","v":5.5500000000000007},null,{"$f":"SUM(J20:J21)-SUM(K20:K21)","v":13.816666666666666},{"$f":"RANK(L20,$L$10:$L$43,0)","v":3}]
[null,null,null,"E",8.4,8.6,8.4,8,8,{"$f":"(SUM(E21:I21)-(MIN(E21:I21)+MAX(E21:I21)))/3","v":8.2666666666666657}]
[null,{"$f":"Data!$B$21","v":12},{"$f":"Data!$C$21","v":"Eresko Elizaveta"},"D",5.0999999999999996,4.4000000000000004,5.4,3.4,null,{"$f":"(SUM(E22:H22)-(MIN(E22:H22)+MAX(E22:H22)))/2","v":4.75},null,{"$f":"SUM(J22:J23)-SUM(K22:K23)","v":12.483333333333331},{"$f":"RANK(L22,$L$10:$L$43,0)","v":10}]
[null,null,null,"E",7.9,8.1,7.4,7.7,7.6,{"$f":"(SUM(E23:I23)-(MIN(E23:I23)+MAX(E23:I23)))/3","v":7.7333333333333316}]
[null,{"$f":"Data!$B$24","v":15},{"$f":"Data!$C$24","v":"Myasnyankina Uliya"},"D",4.8,4.9000000000000004,5.3,5.3,null,{"$f":"(SUM(E24:H24)-(MIN(E24:H24)+MAX(E24:H24)))/2","v":5.1000000000000005},null,{"$f":"SUM(J24:J25)-SUM(K24:K25)","v":13.533333333333331},{"$f":"RANK(L24,$L$10:$L$43,0)","v":6}]
[null,null,null,"E",8.3000000000000007,8.5,8.6,8.5,8.1999999999999993,{"$f":"(SUM(E25:I25)-(MIN(E25:I25)+MAX(E25:I25)))/3","v":8.4333333333333318}]
[null,{"$f":"Data!$B$16","v":7},{"$f":"Data!$C$16","v":0},"D",null,null,null,null,null,{"$f":"(SUM(E26:H26)-(MIN(E26:H26)+MAX(E26:H26)))/2","v":0},null,{"$f":"SUM(J26:J27)-SUM(K26:K27)","v":0},{"$f":"RANK(L26,$L$10:$L$43,0)","v":15}]
[null,null,null,"E",null,null,null,null,null,{"$f":"(SUM(E27:I27)-(MIN(E27:I27)+MAX(E27:I27)))/3","v":0}]
[null,{"$f":"Data!$B$23","v":14},{"$f":"Data!$C$23","v":"Bryshevich Zlata"},"D",4.5999999999999996,6,5.7,5.8,null,{"$f":"(SUM(E28:H28)-(MIN(E28:H28)+MAX(E28:H28)))/2","v":5.7500000000000009},null,{"$f":"SUM(J28:J29)-SUM(K28:K29)","v":13.950000000000003},{"$f":"RANK(L28,$L$10:$L$43,0)","v":1}]
[null,null,null,"E",8.1,8.6999999999999993,8.1999999999999993,8.3000000000000007,8.1,{"$f":"(SUM(E29:I29)-(MIN(E29:I29)+MAX(E29:I29)))/3","v":8.2000000000000011}]
[null,{"$f":"Data!$B$20","v":11},{"$f":"Data!$C$20","v":0},"D",null,null,null,null,null,{"$f":"(SUM(E30:H30)-(MIN(E30:H30)+MAX(E30:H30)))/2","v":0},null,{"$f":"SUM(J30:J31)-SUM(K30:K31)","v":0},{"$f":"RANK(L30,$L$10:$L$43,0)","v":15}]
[null,null,null,"E",null,null,null,null,null,{"$f":"(SUM(E31:I31)-(MIN(E31:I31)+MAX(E31:I31)))/3","v":0}]
[null,{"$f":"Data!$B$25","v":16},{"$f":"Data!$C$25","v":"Lakireva Olga"},"D",null,null,null,null,null,{"$f":"(SUM(E32:H32)-(MIN(E32:H32)+MAX(E32:H32)))/2","v":0},null,12.433,{"$f":"RANK(L32,$L$10:$L$43,0)","v":11}]
[null,null,null,"E",null,null,null,null,null,{"$f":"(SUM(E33:I33)-(MIN(E33:I33)+MAX(E33:I33)))/3","v":0}]
[null,{"$f":"Data!$B$19","v":10},{"$f":"Data!$C$19","v":"Strashko Anna"},"D",null,null,null,null,null,{"$f":"(SUM(E34:H34)-(MIN(E34:H34)+MAX(E34:H34)))/2","v":0},null,13.882999999999999,{"$f":"RANK(L34,$L$10:$L$43,0)","v":2}]
[null,null,null,"E",null,null,null,null,null,{"$f":"(SUM(E35:I35)-(MIN(E35:I35)+MAX(E35:I35)))/3","v":0}]
[null,{"$f":"Data!$B$13","v":4},{"$f":"Data!$C$13","v":"Ansaldo Alice"},"D",null,null,null,null,null,{"$f":"(SUM(E36:H36)-(MIN(E36:H36)+MAX(E36:H36)))/2","v":0},null,9.6,{"$f":"RANK(L36,$L$10:$L$43,0)","v":14}]
[null,null,null,"E",null,null,null,null,null,{"$f":"(SUM(E37:I37)-(MIN(E37:I37)+MAX(E37:I37)))/3","v":0}]
[null,{"$f":"Data!$B$11","v":2},{"$f":"Data!$C$11","v":"Korin Anastasiya"},"D",null,null,null,null,null,{"$f":"(SUM(E38:H38)-(MIN(E38:H38)+MAX(E38:H38)))/2","v":0},null,12.183,{"$f":"RANK(L38,$L$10:$L$43,0)","v":12}]
[null,null,null,"E",null,null,null,null,null,{"$f":"(SUM(E39:I39)-(MIN(E39:I39)+MAX(E39:I39)))/3","v":0}]
[null,{"$f":"Data!$B$12","v":3},{"$f":"Data!$C$12","v":"Ivanova Valeriya"},"D",3.7,4.9000000000000004,5,4.8,null,{"$f":"(SUM(E40:H40)-(MIN(E40:H40)+MAX(E40:H40)))/2","v":4.8500000000000014},null,{"$f":"SUM(J40:J41)-SUM(K40:K41)","v":13.083333333333336},{"$f":"RANK(L40,$L$10:$L$43,0)","v":7}]
[null,null,null,"E",8.4,8.1999999999999993,7.5,8.6,8.1,{"$f":"(SUM(E41:I41)-(MIN(E41:I41)+MAX(E41:I41)))/3","v":8.2333333333333343}]
[null,{"$f":"Data!$B$10","v":1},{"$f":"Data!$C$10","v":"Lenshina Ekaterina"},"D",null,null,null,null,null,{"$f":"(SUM(E42:H42)-(MIN(E42:H42)+MAX(E42:H42)))/2","v":0},null,12.617000000000001,{"$f":"RANK(L42,$L$10:$L$43,0)","v":8}]
[null,null,null,"E",null,null,null,null,null,{"$f":"(SUM(E43:I43)-(MIN(E43:I43)+MAX(E43:I43)))/3","v":0}]

{"sheet":"Вид 2","index":3,"n_rows":43,"n_cols":13,"rows_kept":43,"cut":false,"hidden":false,"merged":[[39,11,40,11],[39,12,40,12],[41,11,42,11],[41,12,42,12],[33,11,34,11],[33,12,34,12],[35,11,36,11],[35,12,36,12],[37,11,38,11],[37,12,38,12],[27,11,28,11],[27,12,28,12],[29,11,30,11],[29,12,30,12],[31,11,32,11],[31,12,32,12],[21,11,22,11],[21,12,22,12],[23,11,24,11],[23,12,24,12],[25,11,26,11],[25,12,26,12],[15,11,16,11],[15,12,16,12],[17,11,18,11],[17,12,18,12],[19,11,20,11],[19,12,20,12],[39,1,40,1],[39,2,40,2],[41,1,42,1],[41,2,42,2],[9,11,10,11],[33,1,34,1],[33,2,34,2],[35,1,36,1],[35,2,36,2],[37,1,38,1],[37,2,38,2],[27,1,28,1],[27,2,28,2],[29,1,30,1],[29,2,30,2],[31,1,32,1],[9,12,10,12],[11,11,12,11],[11,12,12,12],[13,11,14,11],[13,12,14,12],[31,2,32,2],[21,1,22,1],[21,2,22,2],[23,1,24,1],[23,2,24,2],[25,1,26,1],[25,2,26,2],[15,1,16,1],[15,2,16,2],[17,1,18,1],[17,2,18,2],[19,1,20,1],[19,2,20,2],[9,1,10,1],[9,2,10,2],[11,1,12,1],[11,2,12,2],[13,1,14,1],[13,2,14,2]]}
[null,null,null,2,9,13]
[]
[]
[]
[]
[]
[]
[]
[null,"№","Гимнастка",null,1,2,3,4,5,"Оценка","Сбавка","Сумма","МЕСТО"]
[null,{"$f":"Data!$B$15","v":6},{"$f":"Data!$C$15","v":"Ikramova Asal"},"D",null,null,null,null,null,{"$f":"(SUM(E10:H10)-(MIN(E10:H10)+MAX(E10:H10)))/2","v":0},null,{"$f":"SUM(J10:J11)-SUM(K10:K11)","v":0},{"$f":"RANK(L10,$L$10:$L$43,0)","v":15}]
[null,null,null,"E",null,null,null,null,null,{"$f":"(SUM(E11:I11)-(MIN(E11:I11)+MAX(E11:I11)))/3","v":0}]
[null,{"$f":"Data!$B$17","v":8},{"$f":"Data!$C$17","v":"Zilber Sofia"},"D",4.2,5.5,5.4,4.5999999999999996,null,{"$f":"(SUM(E12:H12)-(MIN(E12:H12)+MAX(E12:H12)))/2","v":5},null,{"$f":"SUM(J12:J13)-SUM(K12:K13)","v":12.600000000000001},{"$f":"RANK(L12,$L$10:$L$43,0)","v":3}]
[null,null,null,"E",7.4,8,7.3,7.4,8,{"$f":"(SUM(E13:I13)-(MIN(E13:I13)+MAX(E13:I13)))/3","v":7.6000000000000005}]
[null,{"$f":"Data!$B$22","v":13},{"$f":"Data!$C$22","v":"Pavlovskaya  Appolinariya"},"D",3,4.5,2.5,4.2,null,{"$f":"(SUM(E14:H14)-(MIN(E14:H14)+MAX(E14:H14)))/2","v":3.5999999999999996},null,{"$f":"SUM(J14:J15)-SUM(K14:K15)","v":10.533333333333331},{"$f":"RANK(L14,$L$10:$L$43,0)","v":12}]
[null,null,null,"E",7.8,7,6.6,6.2,7.2,{"$f":"(SUM(E15:I15)-(MIN(E15:I15)+MAX(E15:I15)))/3","v":6.9333333333333327}]
[null,{"$f":"Data!$B$14","v":5},{"$f":"Data!$C$14","v":"Luana Gomes"},"D",3.1,3.8,4.3,4.2,null,{"$f":"(SUM(E16:H16)-(MIN(E16:H16)+MAX(E16:H16)))/2","v":3.9999999999999991},null,{"$f":"SUM(J16:J17)-SUM(K16:K17)","v":11.2},{"$f":"RANK(L16,$L$10:$L$43,0)","v":10}]
[null,null,null,"E",7.8,7.5,6.8,7,7.1,{"$f":"(SUM(E17:I17)-(MIN(E17:I17)+MAX(E17:I17)))/3","v":7.2}]
[null,{"$f":"Data!$B$26","v":17},{"$f":"Data!$C$26","v":"Kurmaeva Maria"},"D",5.7,4.5999999999999996,4.5,4.3,null,{"$f":"(SUM(E18:H18)-(MIN(E18:H18)+MAX(E18:H18)))/2","v":4.5500000000000007},null,{"$f":"SUM(J18:J19)-SUM(K18:K19)","v":12.350000000000001},{"$f":"RANK(L18,$L$10:$L$43,0)","v":4}]
[null,null,null,"E",8.3000000000000007,7.8,7.7,7.4,7.9,{"$f":"(SUM(E19:I19)-(MIN(E19:I19)+MAX(E19:I19)))/3","v":7.8}]
[null,{"$f":"Data!$B$18","v":9},{"$f":"Data!$C$18","v":"Brilyakova Darya"},"D",4.2,3.9,4.3,4.7,null,{"$f":"(SUM(E20:H20)-(MIN(E20:H20)+MAX(E20:H20)))/2","v":4.2499999999999991},null,{"$f":"SUM(J20:J21)-SUM(K20:K21)","v":11.483333333333333},{"$f":"RANK(L20,$L$10:$L$43,0)","v":9}]
[null,null,null,"E",7.2,7.2,5.7,7.3,7.6,{"$f":"(SUM(E21:I21)-(MIN(E21:I21)+MAX(E21:I21)))/3","v":7.2333333333333334}]
[null,{"$f":"Data!$B$21","v":12},{"$f":"Data!$C$21","v":"Eresko Elizaveta"},"D",3.8,4.9000000000000004,4.0999999999999996,5.2,null,{"$f":"(SUM(E22:H22)-(MIN(E22:H22)+MAX(E22:H22)))/2","v":4.5},null,{"$f":"SUM(J22:J23)-SUM(K22:K23)","v":11.799999999999997},{"$f":"RANK(L22,$L$10:$L$43,0)","v":8}]
[null,null,null,"E",7.1,7.4,6.9,7.4,7.4,{"$f":"(SUM(E23:I23)-(MIN(E23:I23)+MAX(E23:I23)))/3","v":7.299999999999998}]
[null,{"$f":"Data!$B$24","v":15},{"$f":"Data!$C$24","v":"Myasnyankina Uliya"},"D",4.5,4.8,6.3,5.6,null,{"$f":"(SUM(E24:H24)-(MIN(E24:H24)+MAX(E24:H24)))/2","v":5.2000000000000011},null,{"$f":"SUM(J24:J25)-SUM(K24:K25)","v":13.266666666666669},{"$f":"RANK(L24,$L$10:$L$43,0)","v":2}]
[null,null,null,"E",8.1999999999999993,7.9,8.1,7.8,8.1999999999999993,{"$f":"(SUM(E25:I25)-(MIN(E25:I25)+MAX(E25:I25)))/3","v":8.0666666666666682}]
[null,{"$f":"Data!$B$16","v":7},{"$f":"Data!$C$16","v":0},"D",null,null,null,null,null,{"$f":"(SUM(E26:H26)-(MIN(E26:H26)+MAX(E26:H26)))/2","v":0},null,{"$f":"SUM(J26:J27)-SUM(K26:K27)","v":0},{"$f":"RANK(L26,$L$10:$L$43,0)","v":15}]
[null,null,null,"E",null,null,null,null,null,{"$f":"(SUM(E27:I27)-(MIN(E27:I27)+MAX(E27:I27)))/3","v":0}]
[null,{"$f":"Data!$B$23","v":14},{"$f":"Data!$C$23","v":"Bryshevich Zlata"},"D",5.3,6.3,6.1,6.6,null,{"$f":"(SUM(E28:H28)-(MIN(E28:H28)+MAX(E28:H28)))/2","v":6.1999999999999993},null,{"$f":"SUM(J28:J29)-SUM(K28:K29)","v":13.899999999999999},{"$f":"RANK(L28,$L$10:$L$43,0)","v":1}]
[null,null,null,"E",7.7,8,7.3,7.5,7.9,{"$f":"(SUM(E29:I29)-(MIN(E29:I29)+MAX(E29:I29)))/3","v":7.6999999999999993}]
[null,{"$f":"Data!$B$20","v":11},{"$f":"Data!$C$20","v":0},"D",null,null,null,null,null,{"$f":"(SUM(E30:H30)-(MIN(E30:H30)+MAX(E30:H30)))/2","v":0},null,{"$f":"SUM(J30:J31)-SUM(K30:K31)","v":0},{"$f":"RANK(L30,$L$10:$L$43,0)","v":15}]
[null,null,null,"E",null,null,null,null,null,{"$f":"(SUM(E31:I31)-(MIN(E31:I31)+MAX(E31:I31)))/3","v":0}]
[null,{"$f":"Data!$B$25","v":16},{"$f":"Data!$C$25","v":"Lakireva Olga"},"D",2.1,2.8,3.2,2.8,null,{"$f":"(SUM(E32:H32)-(MIN(E32:H32)+MAX(E32:H32)))/2","v":2.8000000000000007},null,{"$f":"SUM(J32:J33)-SUM(K32:K33)","v":9.9666666666666686},{"$f":"RANK(L32,$L$10:$L$43,0)","v":13}]
[null,null,null,"E",7.3,7.3,7,6.7,7.2,{"$f":"(SUM(E33:I33)-(MIN(E33:I33)+MAX(E33:I33)))/3","v":7.166666666666667}]
[null,{"$f":"Data!$B$19","v":10},{"$f":"Data!$C$19","v":"Strashko Anna"},"D",3.4,5.4,4.5,4.4000000000000004,null,{"$f":"(SUM(E34:H34)-(MIN(E34:H34)+MAX(E34:H34)))/2","v":4.4500000000000011},null,{"$f":"SUM(J34:J35)-SUM(K34:K35)","v":11.916666666666668},{"$f":"RANK(L34,$L$10:$L$43,0)","v":6}]
[null,null,null,"E",8.1999999999999993,7.7,6.8,7,7.7,{"$f":"(SUM(E35:I35)-(MIN(E35:I35)+MAX(E35:I35)))/3","v":7.4666666666666659}]
[null,{"$f":"Data!$B$13","v":4},{"$f":"Data!$C$13","v":"Ansaldo Alice"},"D",1.8,1.8,2.5,2.4,null,{"$f":"(SUM(E36:H36)-(MIN(E36:H36)+MAX(E36:H36)))/2","v":2.1},null,{"$f":"SUM(J36:J37)-SUM(K36:K37)","v":8.7000000000000011},{"$f":"RANK(L36,$L$10:$L$43,0)","v":14}]
[null,null,null,"E",6.3,6.8,6.6,6.4,7,{"$f":"(SUM(E37:I37)-(MIN(E37:I37)+MAX(E37:I37)))/3","v":6.6000000000000005}]
[null,{"$f":"Data!$B$11","v":2},{"$f":"Data!$C$11","v":"Korin Anastasiya"},"D",2.7,3,4.3,3.5,null,{"$f":"(SUM(E38:H38)-(MIN(E38:H38)+MAX(E38:H38)))/2","v":3.25},null,{"$f":"SUM(J38:J39)-SUM(K38:K39)","v":10.650000000000002},{"$f":"RANK(L38,$L$10:$L$43,0)","v":11}]
[null,null,null,"E",7.9,7.2,6.8,7.5,7.5,{"$f":"(SUM(E39:I39)-(MIN(E39:I39)+MAX(E39:I39)))/3","v":7.4000000000000021}]
[null,{"$f":"Data!$B$12","v":3},{"$f":"Data!$C$12","v":"Ivanova Valeriya"},"D",4.3,4,5.7,4.0999999999999996,null,{"$f":"(SUM(E40:H40)-(MIN(E40:H40)+MAX(E40:H40)))/2","v":4.2000000000000011},null,{"$f":"SUM(J40:J41)-SUM(K40:K41)","v":11.899999999999999},{"$f":"RANK(L40,$L$10:$L$43,0)","v":7}]
[null,null,null,"E",8.3000000000000007,7.7,7.4,7.8,7.6,{"$f":"(SUM(E41:I41)-(MIN(E41:I41)+MAX(E41:I41)))/3","v":7.6999999999999984}]
[null,{"$f":"Data!$B$10","v":1},{"$f":"Data!$C$10","v":"Lenshina Ekaterina"},"D",4.3,4.5,4.9000000000000004,4.3,null,{"$f":"(SUM(E42:H42)-(MIN(E42:H42)+MAX(E42:H42)))/2","v":4.4000000000000004},null,{"$f":"SUM(J42:J43)-SUM(K42:K43)","v":11.933333333333334},{"$f":"RANK(L42,$L$10:$L$43,0)","v":5}]
[null,null,null,"E",8.1,7.4,7.5,7.3,7.7,{"$f":"(SUM(E43:I43)-(MIN(E43:I43)+MAX(E43:I43)))/3","v":7.5333333333333341}]

{"sheet":"Вид 3","index":4,"n_rows":43,"n_cols":13,"rows_kept":43,"cut":false,"hidden":false,"merged":[[39,11,40,11],[39,12,40,12],[41,11,42,11],[41,12,42,12],[33,11,34,11],[33,12,34,12],[35,11,36,11],[35,12,36,12],[37,11,38,11],[37,12,38,12],[27,11,28,11],[27,12,28,12],[29,11,30,11],[29,12,30,12],[31,11,32,11],[31,12,32,12],[21,11,22,11],[21,12,22,12],[23,11,24,11],[23,12,24,12],[25,11,26,11],[25,12,26,12],[15,11,16,11],[15,12,16,12],[17,11,18,11],[17,12,18,12],[19,11,20,11],[19,12,20,12],[39,1,40,1],[39,2,40,2],[41,1,42,1],[41,2,42,2],[9,11,10,11],[33,1,34,1],[33,2,34,2],[35,1,36,1],[35,2,36,2],[37,1,38,1],[37,2,38,2],[27,1,28,1],[27,2,28,2],[29,1,30,1],[29,2,30,2],[31,1,32,1],[9,12,10,12],[11,11,12,11],[11,12,12,12],[13,11,14,11],[13,12,14,12],[31,2,32,2],[21,1,22,1],[21,2,22,2],[23,1,24,1],[23,2,24,2],[25,1,26,1],[25,2,26,2],[15,1,16,1],[15,2,16,2],[17,1,18,1],[17,2,18,2],[19,1,20,1],[19,2,20,2],[9,1,10,1],[9,2,10,2],[11,1,12,1],[11,2,12,2],[13,1,14,1],[13,2,14,2]]}
[null,null,null,2,9,13]
[]
[]
[]
[]
[]
[]
[]
[null,"№","Гимнастка",null,1,2,3,4,5,"Оценка","Сбавка","Сумма","МЕСТО"]
[null,{"$f":"Data!$B$15","v":6},{"$f":"Data!$C$15","v":"Ikramova Asal"},"D",null,null,null,null,null,{"$f":"(SUM(E10:H10)-(MIN(E10:H10)+MAX(E10:H10)))/2","v":0},null,{"$f":"SUM(J10:J11)-SUM(K10:K11)","v":0},{"$f":"RANK(L10,$L$10:$L$43,0)","v":15}]
[null,null,null,"E",null,null,null,null,null,{"$f":"(SUM(E11:I11)-(MIN(E11:I11)+MAX(E11:I11)))/3","v":0}]
[null,{"$f":"Data!$B$17","v":8},{"$f":"Data!$C$17","v":"Zilber Sofia"},"D",4.5,4.5999999999999996,3.8,4.5,null,{"$f":"(SUM(E12:H12)-(MIN(E12:H12)+MAX(E12:H12)))/2","v":4.5},null,{"$f":"SUM(J12:J13)-SUM(K12:K13)","v":11.833333333333332},{"$f":"RANK(L12,$L$10:$L$43,0)","v":10}]
[null,null,null,"E",7.4,6.3,7,7.6,7.7,{"$f":"(SUM(E13:I13)-(MIN(E13:I13)+MAX(E13:I13)))/3","v":7.333333333333333}]
[null,{"$f":"Data!$B$22","v":13},{"$f":"Data!$C$22","v":"Pavlovskaya  Appolinariya"},"D",5.2,5.0999999999999996,2.8,5.5,null,{"$f":"(SUM(E14:H14)-(MIN(E14:H14)+MAX(E14:H14)))/2","v":5.15},null,{"$f":"SUM(J14:J15)-SUM(K14:K15)","v":12.816666666666668},{"$f":"RANK(L14,$L$10:$L$43,0)","v":5}]
[null,null,null,"E",7.4,7.8,7.9,7.5,7.7,{"$f":"(SUM(E15:I15)-(MIN(E15:I15)+MAX(E15:I15)))/3","v":7.6666666666666679}]
[null,{"$f":"Data!$B$14","v":5},{"$f":"Data!$C$14","v":"Luana Gomes"},"D",1.8,2.2999999999999998,1.7,2.6,null,{"$f":"(SUM(E16:H16)-(MIN(E16:H16)+MAX(E16:H16)))/2","v":2.0500000000000003},null,{"$f":"SUM(J16:J17)-SUM(K16:K17)","v":7.7833333333333332},{"$f":"RANK(L16,$L$10:$L$43,0)","v":13}]
[null,null,null,"E",5,6.3,5.7,5.5,6,{"$f":"(SUM(E17:I17)-(MIN(E17:I17)+MAX(E17:I17)))/3","v":5.7333333333333334}]
[null,{"$f":"Data!$B$26","v":17},{"$f":"Data!$C$26","v":"Kurmaeva Maria"},"D",6.2,5.5,4.7,5.4,null,{"$f":"(SUM(E18:H18)-(MIN(E18:H18)+MAX(E18:H18)))/2","v":5.4499999999999984},null,{"$f":"SUM(J18:J19)-SUM(K18:K19)","v":13.116666666666665},{"$f":"RANK(L18,$L$10:$L$43,0)","v":3}]
[null,null,null,"E",7.6,7.5,7.9,7.8,7.6,{"$f":"(SUM(E19:I19)-(MIN(E19:I19)+MAX(E19:I19)))/3","v":7.666666666666667}]
[null,{"$f":"Data!$B$18","v":9},{"$f":"Data!$C$18","v":"Brilyakova Darya"},"D",4.9000000000000004,5.5,4.5,5.0999999999999996,null,{"$f":"(SUM(E20:H20)-(MIN(E20:H20)+MAX(E20:H20)))/2","v":5},null,{"$f":"SUM(J20:J21)-SUM(K20:K21)","v":12.5},{"$f":"RANK(L20,$L$10:$L$43,0)","v":6}]
[null,null,null,"E",8.1,7.1,7.4,7.9,7.2,{"$f":"(SUM(E21:I21)-(MIN(E21:I21)+MAX(E21:I21)))/3","v":7.5000000000000009}]
[null,{"$f":"Data!$B$21","v":12},{"$f":"Data!$C$21","v":"Eresko Elizaveta"},"D",5.2,4.8,4,4.3,null,{"$f":"(SUM(E22:H22)-(MIN(E22:H22)+MAX(E22:H22)))/2","v":4.5500000000000007},null,{"$f":"SUM(J22:J23)-SUM(K22:K23)","v":11.883333333333336},{"$f":"RANK(L22,$L$10:$L$43,0)","v":8}]
[null,null,null,"E",7.6,6.7,7.5,7.4,7.1,{"$f":"(SUM(E23:I23)-(MIN(E23:I23)+MAX(E23:I23)))/3","v":7.3333333333333348}]
[null,{"$f":"Data!$B$24","v":15},{"$f":"Data!$C$24","v":"Myasnyankina Uliya"},"D",6.5,5.6,6,5.8,null,{"$f":"(SUM(E24:H24)-(MIN(E24:H24)+MAX(E24:H24)))/2","v":5.9000000000000012},null,{"$f":"SUM(J24:J25)-SUM(K24:K25)","v":13.833333333333332},{"$f":"RANK(L24,$L$10:$L$43,0)","v":1}]
[null,null,null,"E",7.8,8.5,7.6,8.4,7.3,{"$f":"(SUM(E25:I25)-(MIN(E25:I25)+MAX(E25:I25)))/3","v":7.9333333333333309}]
[null,{"$f":"Data!$B$16","v":7},{"$f":"Data!$C$16","v":0},"D",null,null,null,null,null,{"$f":"(SUM(E26:H26)-(MIN(E26:H26)+MAX(E26:H26)))/2","v":0},null,{"$f":"SUM(J26:J27)-SUM(K26:K27)","v":0},{"$f":"RANK(L26,$L$10:$L$43,0)","v":15}]
[null,null,null,"E",null,null,null,null,null,{"$f":"(SUM(E27:I27)-(MIN(E27:I27)+MAX(E27:I27)))/3","v":0}]
[null,{"$f":"Data!$B$23","v":14},{"$f":"Data!$C$23","v":"Bryshevich Zlata"},"D",5.0999999999999996,5.6,3.2,5.8,null,{"$f":"(SUM(E28:H28)-(MIN(E28:H28)+MAX(E28:H28)))/2","v":5.35},null,{"$f":"SUM(J28:J29)-SUM(K28:K29)","v":13.249999999999998},{"$f":"RANK(L28,$L$10:$L$43,0)","v":2}]
[null,null,null,"E",8,8,8,7.7,7.6,{"$f":"(SUM(E29:I29)-(MIN(E29:I29)+MAX(E29:I29)))/3","v":7.8999999999999986}]
[null,{"$f":"Data!$B$20","v":11},{"$f":"Data!$C$20","v":0},"D",null,null,null,null,null,{"$f":"(SUM(E30:H30)-(MIN(E30:H30)+MAX(E30:H30)))/2","v":0},null,{"$f":"SUM(J30:J31)-SUM(K30:K31)","v":0},{"$f":"RANK(L30,$L$10:$L$43,0)","v":15}]
[null,null,null,"E",null,null,null,null,null,{"$f":"(SUM(E31:I31)-(MIN(E31:I31)+MAX(E31:I31)))/3","v":0}]
[null,{"$f":"Data!$B$25","v":16},{"$f":"Data!$C$25","v":"Lakireva Olga"},"D",5.3,5.2,4.5999999999999996,4.7,null,{"$f":"(SUM(E32:H32)-(MIN(E32:H32)+MAX(E32:H32)))/2","v":4.9500000000000011},null,{"$f":"SUM(J32:J33)-SUM(K32:K33)","v":12.850000000000001},{"$f":"RANK(L32,$L$10:$L$43,0)","v":4}]
[null,null,null,"E",8,7.5,8.5,7.8,7.9,{"$f":"(SUM(E33:I33)-(MIN(E33:I33)+MAX(E33:I33)))/3","v":7.9000000000000012}]
[null,{"$f":"Data!$B$19","v":10},{"$f":"Data!$C$19","v":"Strashko Anna"},"D",4.4000000000000004,5.6,4.5,5.0999999999999996,null,{"$f":"(SUM(E34:H34)-(MIN(E34:H34)+MAX(E34:H34)))/2","v":4.8000000000000007},null,{"$f":"SUM(J34:J35)-SUM(K34:K35)","v":11.366666666666665},{"$f":"RANK(L34,$L$10:$L$43,0)","v":12}]
[null,null,null,"E",7.1,7,7.4,7.4,6.9,{"$f":"(SUM(E35:I35)-(MIN(E35:I35)+MAX(E35:I35)))/3","v":7.1666666666666652},0.6]
[null,{"$f":"Data!$B$13","v":4},{"$f":"Data!$C$13","v":"Ansaldo Alice"},"D",1.3,0.9,0.4,1.6,null,{"$f":"(SUM(E36:H36)-(MIN(E36:H36)+MAX(E36:H36)))/2","v":1.1000000000000001},null,{"$f":"SUM(J36:J37)-SUM(K36:K37)","v":6.4},{"$f":"RANK(L36,$L$10:$L$43,0)","v":14}]
[null,null,null,"E",5,5.2,5.0999999999999996,5.6,5.7,{"$f":"(SUM(E37:I37)-(MIN(E37:I37)+MAX(E37:I37)))/3","v":5.3}]
[null,{"$f":"Data!$B$11","v":2},{"$f":"Data!$C$11","v":"Korin Anastasiya"},"D",4.7,4,3.2,4,null,{"$f":"(SUM(E38:H38)-(MIN(E38:H38)+MAX(E38:H38)))/2","v":3.9999999999999991},null,{"$f":"SUM(J38:J39)-SUM(K38:K39)","v":11.466666666666665},{"$f":"RANK(L38,$L$10:$L$43,0)","v":11}]
[null,null,null,"E",7.5,5.7,7.5,7.7,7.4,{"$f":"(SUM(E39:I39)-(MIN(E39:I39)+MAX(E39:I39)))/3","v":7.4666666666666659}]
[null,{"$f":"Data!$B$12","v":3},{"$f":"Data!$C$12","v":"Ivanova Valeriya"},"D",4.2,4.7,4.4000000000000004,4.9000000000000004,null,{"$f":"(SUM(E40:H40)-(MIN(E40:H40)+MAX(E40:H40)))/2","v":4.5500000000000007},null,{"$f":"SUM(J40:J41)-SUM(K40:K41)","v":11.883333333333333},{"$f":"RANK(L40,$L$10:$L$43,0)","v":9}]
[null,null,null,"E",7.9,7.3,7.1,7.6,7.1,{"$f":"(SUM(E41:I41)-(MIN(E41:I41)+MAX(E41:I41)))/3","v":7.333333333333333}]
[null,{"$f":"Data!$B$10","v":1},{"$f":"Data!$C$10","v":"Lenshina Ekaterina"},"D",4.8,4.9000000000000004,4.0999999999999996,4.5999999999999996,null,{"$f":"(SUM(E42:H42)-(MIN(E42:H42)+MAX(E42:H42)))/2","v":4.6999999999999993},null,{"$f":"SUM(J42:J43)-SUM(K42:K43)","v":11.966666666666665},{"$f":"RANK(L42,$L$10:$L$43,0)","v":7}]
[null,null,null,"E",7.4,6.5,8,7.4,7,{"$f":"(SUM(E43:I43)-(MIN(E43:I43)+MAX(E43:I43)))/3","v":7.2666666666666657}]

{"sheet":"Protocol","index":5,"n_rows":28,"n_cols":11,"rows_kept":28,"cut":false,"hidden":false,"merged":[[6,4,6,7],[25,5,25,11],[27,5,27,10],[0,2,3,9]]}
[null,null,"International individual/national groups Rhythmic Gymnastic  Tournament\n«MARINA CUP»  April 17-21nd 2014\n"]
[]
[]
[]
[]
[]
[null,null,null,"Resuilts",2003]
[]
[null,null,"№","gymnast","Разряд","country",null,"type","type","total","Rank"]
[null,null,1,{"$f":"IF(ISBLANK(Data!$C$23), \"\", Data!$C$23)","v":"Bryshevich Zlata"},{"$f":"IF(ISBLANK(Data!$D$23), \"\", Data!$D$23)","v":2003},{"$f":"IF(ISBLANK(Data!$F$23), \"\", Data!$F$23)","v":"RUS Severs"},{"$f":"'Вид 1'!$L$28","v":13.950000000000003},{"$f":"'Вид 2'!$L$28","v":13.899999999999999},{"$f":"'Вид 3'!$L$28","v":13.249999999999998},{"$f":"SUM(G10:I10)","v":41.1},1]
[null,null,2,{"$f":"IF(ISBLANK(Data!$C$24), \"\", Data!$C$24)","v":"Myasnyankina Uliya"},{"$f":"IF(ISBLANK(Data!$D$24), \"\", Data!$D$24)","v":2003},{"$f":"IF(ISBLANK(Data!$F$24), \"\", Data!$F$24)","v":"RUS Tomsk"},{"$f":"'Вид 1'!$L$24","v":13.533333333333331},{"$f":"'Вид 2'!$L$24","v":13.266666666666669},{"$f":"'Вид 3'!$L$24","v":13.833333333333332},40.633333333333333,2]
[null,null,3,{"$f":"IF(ISBLANK(Data!$C$14), \"\", Data!$C$14)","v":"Luana Gomes"},{"$f":"IF(ISBLANK(Data!$D$14), \"\", Data!$D$14)","v":2003},{"$f":"IF(ISBLANK(Data!$F$14), \"\", Data!$F$14)","v":"POR"},{"$f":"'Вид 1'!$L$16","v":12.15},{"$f":"'Вид 2'!$L$16","v":11.2},{"$f":"'Вид 3'!$L$16","v":7.7833333333333332},31.133333333333333,3]
[null,null,4,{"$f":"IF(ISBLANK(Data!$C$13), \"\", Data!$C$13)","v":"Ansaldo Alice"},{"$f":"IF(ISBLANK(Data!$D$13), \"\", Data!$D$13)","v":2003},{"$f":"IF(ISBLANK(Data!$F$13), \"\", Data!$F$13)","v":"ITA"},{"$f":"'Вид 1'!$L$36","v":9.6},{"$f":"'Вид 2'!$L$36","v":8.7000000000000011},{"$f":"'Вид 3'!$L$36","v":6.4},24.700000000000003,4]
[null,null,5,{"$f":"IF(ISBLANK(Data!$C$26), \"\", Data!$C$26)","v":"Kurmaeva Maria"},{"$f":"IF(ISBLANK(Data!$D$26), \"\", Data!$D$26)","v":2003},{"$f":"IF(ISBLANK(Data!$F$26), \"\", Data!$F$26)","v":"RUS Shuya"},{"$f":"'Вид 1'!$L$18","v":13.65},{"$f":"'Вид 2'!$L$18","v":12.350000000000001},{"$f":"'Вид 3'!$L$18","v":13.116666666666665},39.116666666666667,5]
[null,null,6,{"$f":"IF(ISBLANK(Data!$C$17), \"\", Data!$C$17)","v":"Zilber Sofia"},{"$f":"IF(ISBLANK(Data!$D$17), \"\", Data!$D$17)","v":2003},{"$f":"IF(ISBLANK(Data!$F$17), \"\", Data!$F$17)","v":"RUS Eketerinburg"},{"$f":"'Вид 1'!$L$12","v":13.733333333333338},{"$f":"'Вид 2'!$L$12","v":12.600000000000001},{"$f":"'Вид 3'!$L$12","v":11.833333333333332},38.166666666666671,6]
[null,null,7,{"$f":"IF(ISBLANK(Data!$C$18), \"\", Data!$C$18)","v":"Brilyakova Darya"},{"$f":"IF(ISBLANK(Data!$D$18), \"\", Data!$D$18)","v":2003},{"$f":"IF(ISBLANK(Data!$F$18), \"\", Data!$F$18)","v":"RUS Krasnoyarsk"},{"$f":"'Вид 1'!$L$20","v":13.816666666666666},{"$f":"'Вид 2'!$L$20","v":11.483333333333333},{"$f":"'Вид 3'!$L$20","v":12.5},37.799999999999997,7]
[null,null,8,{"$f":"IF(ISBLANK(Data!$C$19), \"\", Data!$C$19)","v":"Strashko Anna"},{"$f":"IF(ISBLANK(Data!$D$19), \"\", Data!$D$19)","v":2003},{"$f":"IF(ISBLANK(Data!$F$19), \"\", Data!$F$19)","v":"RUS Orehovo-Zuevo"},{"$f":"'Вид 1'!$L$34","v":13.882999999999999},{"$f":"'Вид 2'!$L$34","v":11.916666666666668},{"$f":"'Вид 3'!$L$34","v":11.366666666666665},37.166333333333334,8]
[null,null,9,{"$f":"IF(ISBLANK(Data!$C$12), \"\", Data!$C$12)","v":"Ivanova Valeriya"},{"$f":"IF(ISBLANK(Data!$D$12), \"\", Data!$D$12)","v":2003},{"$f":"IF(ISBLANK(Data!$F$12), \"\", Data!$F$12)","v":"RUS Ivanovo"},{"$f":"'Вид 1'!$L$40","v":13.083333333333336},{"$f":"'Вид 2'!$L$40","v":11.899999999999999},{"$f":"'Вид 3'!$L$40","v":11.883333333333333},36.866666666666667,9]
[null,null,10,{"$f":"IF(ISBLANK(Data!$C$10), \"\", Data!$C$10)","v":"Lenshina Ekaterina"},{"$f":"IF(ISBLANK(Data!$D$10), \"\", Data!$D$10)","v":2003},{"$f":"IF(ISBLANK(Data!$F$10), \"\", Data!$F$10)","v":"RUS Ivanovo"},{"$f":"'Вид 1'!$L$42","v":12.617000000000001},{"$f":"'Вид 2'!$L$42","v":11.933333333333334},{"$f":"'Вид 3'!$L$42","v":11.966666666666665},36.516999999999996,10]
[null,null,11,{"$f":"IF(ISBLANK(Data!$C$21), \"\", Data!$C$21)","v":"Eresko Elizaveta"},{"$f":"IF(ISBLANK(Data!$D$21), \"\", Data!$D$21)","v":2003},{"$f":"IF(ISBLANK(Data!$F$21), \"\", Data!$F$21)","v":"RUS St.Peterburg"},{"$f":"'Вид 1'!$L$22","v":12.483333333333331},{"$f":"'Вид 2'!$L$22","v":11.799999999999997},{"$f":"'Вид 3'!$L$22","v":11.883333333333336},36.166666666666664,11]
[null,null,12,{"$f":"IF(ISBLANK(Data!$C$22), \"\", Data!$C$22)","v":"Pavlovskaya  Appolinariya"},{"$f":"IF(ISBLANK(Data!$D$22), \"\", Data!$D$22)","v":2003},{"$f":"IF(ISBLANK(Data!$F$22), \"\", Data!$F$22)","v":"RUS St.Peterburg"},{"$f":"'Вид 1'!$L$14","v":12.616666666666671},{"$f":"'Вид 2'!$L$14","v":10.533333333333331},{"$f":"'Вид 3'!$L$14","v":12.816666666666668},35.966666666666669,12]
[null,null,13,{"$f":"IF(ISBLANK(Data!$C$25), \"\", Data!$C$25)","v":"Lakireva Olga"},{"$f":"IF(ISBLANK(Data!$D$25), \"\", Data!$D$25)","v":2003},{"$f":"IF(ISBLANK(Data!$F$25), \"\", Data!$F$25)","v":"RUS Chelyabinsk"},{"$f":"'Вид 1'!$L$32","v":12.433},{"$f":"'Вид 2'!$L$32","v":9.9666666666666686},{"$f":"'Вид 3'!$L$32","v":12.850000000000001},35.24966666666667,13]
[null,null,14,{"$f":"IF(ISBLANK(Data!$C$11), \"\", Data!$C$11)","v":"Korin Anastasiya"},{"$f":"IF(ISBLANK(Data!$D$11), \"\", Data!$D$11)","v":2003},{"$f":"IF(ISBLANK(Data!$F$11), \"\", Data!$F$11)","v":"RUS Ivanovo"},{"$f":"'Вид 1'!$L$38","v":12.183},{"$f":"'Вид 2'!$L$38","v":10.650000000000002},{"$f":"'Вид 3'!$L$38","v":11.466666666666665},34.299666666666667,14]
[]
[]
[null,null,"  Сhief justice",null,null,"Bravet Quesis Juana Maria FIG CUBA"]
[]
[null,null,"  Chief Secretary",null,null,"                   Kalinina Lyubov                    NK RUSSIA"]